Target
Glutamate receptor 3
Ligand
BDBM85217
Substrate
Ki
>10000±n/a nM
Comments
PDSP_869
Citation
 Varney, MARao, SPJachec, CDeal, CHess, SDDaggett, LPLin, FJohnson, ECVeliçelebi, G Pharmacological characterization of the human ionotropic glutamate receptor subtype GluR3 stably expressed in mammalian cells. J Pharmacol Exp Ther 285:358-70 (1998) Target
Name:
Glutamate receptor 3
Synonyms:
AMPA-selective glutamate receptor 3 GLURC GRIA3_HUMAN GluR-C Glutamate receptor 3 Glutamate receptor ionotropic, AMPA 3
Type:
PROTEIN
Mol. Mass.:
101172.14
Organism:
Homo sapiens (Human)
Description:
ChEMBL_468627
Residue:
894
  
Inhibitor
Name:
BDBM85217
Synonyms:
CAS_90237-02-8 NSC_119558
Type:
Small organic molecule
Emp. Form.:
C6H12N2O6S
Mol. Mass.:
240.234
SMILES:
NC(CCC(=O)NCS(O)(=O)=O)C(O)=O
: