Target
Glutamate receptor 3
Ligand
BDBM50289498
Substrate
Ki
380±n/a nM
Comments
PDSP_1293
Citation
 Varney, MARao, SPJachec, CDeal, CHess, SDDaggett, LPLin, FJohnson, ECVeliçelebi, G Pharmacological characterization of the human ionotropic glutamate receptor subtype GluR3 stably expressed in mammalian cells. J Pharmacol Exp Ther 285:358-70 (1998) Target
Name:
Glutamate receptor 3
Synonyms:
AMPA-selective glutamate receptor 3 GLURC GRIA3_HUMAN GluR-C Glutamate receptor 3 Glutamate receptor ionotropic, AMPA 3
Type:
PROTEIN
Mol. Mass.:
101172.14
Organism:
Homo sapiens (Human)
Description:
ChEMBL_468627
Residue:
894
  
Inhibitor
Name:
BDBM50289498
Synonyms:
3-Hydroxy-6-nitro-7-sulfamoyl-benzo[f]quinoxalin-2-ol anion | NBQX
Type:
Small organic molecule
Emp. Form.:
C12H7N4O6S
Mol. Mass.:
335.273
SMILES:
NS(=O)(=O)c1cccc2c1c(cc1[n-]c(=[OH+])c(=O)[n-]c21)[N+]([O-])=O
: