Target
Glutamate receptor 3
Ligand
BDBM85215
Substrate
Ki
>10000±n/a nM
Comments
PDSP_1392
Citation
 Varney, MARao, SPJachec, CDeal, CHess, SDDaggett, LPLin, FJohnson, ECVeliçelebi, G Pharmacological characterization of the human ionotropic glutamate receptor subtype GluR3 stably expressed in mammalian cells. J Pharmacol Exp Ther 285:358-70 (1998) Target
Name:
Glutamate receptor 3
Synonyms:
AMPA-selective glutamate receptor 3 GLURC GRIA3_HUMAN GluR-C Glutamate receptor 3 Glutamate receptor ionotropic, AMPA 3
Type:
PROTEIN
Mol. Mass.:
101172.14
Organism:
Homo sapiens (Human)
Description:
ChEMBL_468627
Residue:
894
  
Inhibitor
Name:
BDBM85215
Synonyms:
CAS_136623-01-3 NSC_5311098
Type:
Small organic molecule
Emp. Form.:
C12H11N3O4
Mol. Mass.:
261.2334
SMILES:
ONC1=c2ccc3C(CCCc3c2=NC1=O)[N+]([O-])=O
: