Target
Glutamate receptor 3
Ligand
BDBM50289499
Substrate
Ki
8450±n/a nM
Comments
PDSP_1393
Citation
 Varney, MARao, SPJachec, CDeal, CHess, SDDaggett, LPLin, FJohnson, ECVeliçelebi, G Pharmacological characterization of the human ionotropic glutamate receptor subtype GluR3 stably expressed in mammalian cells. J Pharmacol Exp Ther 285:358-70 (1998) Target
Name:
Glutamate receptor 3
Synonyms:
AMPA-selective glutamate receptor 3 GLURC GRIA3_HUMAN GluR-C Glutamate receptor 3 Glutamate receptor ionotropic, AMPA 3
Type:
PROTEIN
Mol. Mass.:
101172.14
Organism:
Homo sapiens (Human)
Description:
ChEMBL_468627
Residue:
894
  
Inhibitor
Name:
BDBM50289499
Synonyms:
(3E,7S)-5-[(dimethylamino)sulfonyl]-3-(hydroxyimino)-7-methyl-2-oxo-1,2,3,6,7,8-hexahydropyrrolo[3,4-g]indol-7-ium NS257
Type:
Small organic molecule
Emp. Form.:
C13H16N4O4S
Mol. Mass.:
324.356
SMILES:
CN(C)S(=O)(=O)c1cc2[c-](N=O)c(=O)[nH]c2c2C[NH+](C)Cc12
: