Target
Sodium-dependent dopamine transporter
Ligand
BDBM50254790
Substrate
Ki
420±n/a nM
Comments
PDSP_1361
Citation
 Tatsumi, MGroshan, KBlakely, RDRichelson, E Pharmacological profile of antidepressants and related compounds at human monoamine transporters. Eur J Pharmacol 340:249-58 (1997)  
Target
Name:
Sodium-dependent dopamine transporter
Synonyms:
DA transporter DAT1 Dopamine transporter protein (DAT) SC6A3_HUMAN Sodium-dependent dopamine transporter Solute carrier family 6 member 3
Type:
Multi-pass membrane protein
Mol. Mass.:
68497.11
Organism:
Homo sapiens (Human)
Description:
Q01959
Residue:
620
  
Inhibitor
Name:
BDBM50254790
Synonyms:
(S)-Norfluoxetine NORFLUOXETINE
Type:
Small organic molecule
Emp. Form.:
C16H16F3NO
Mol. Mass.:
295.2995
SMILES:
NCC[C@H](Oc1ccc(cc1)C(F)(F)F)c1ccccc1
: