Target
D(4) dopamine receptor
Ligand
BDBM82478
Substrate
Ki
20±n/a nM
Comments
PDSP_1298
Citation
 Seeman, PTallerico, T Antipsychotic drugs which elicit little or no parkinsonism bind more loosely than dopamine to brain D2 receptors, yet occupy high levels of these receptors. Mol Psychiatry 3:123-34 (1998)  
Target
Name:
D(4) dopamine receptor
Synonyms:
D(2C) dopamine receptor DOPAMINE D4.2 DRD4 Dopamine D4 receptor
Type:
Enzyme
Mol. Mass.:
48373.19
Organism:
Homo sapiens (Human)
Description:
P21917
Residue:
419
  
Inhibitor
Name:
BDBM82478
Synonyms:
CAS_2820 NSC_2820
Type:
Small organic molecule
Emp. Form.:
C17H17ClN4
Mol. Mass.:
312.797
SMILES:
Clc1ccc2N=c3ccccc3=C(Nc2c1)N1CCNCC1
: