Target
Somatostatin receptor type 2
Ligand
BDBM82465
Substrate
Ki
0.57±n/a nM
Comments
PDSP_374
Citation
 Meyerhof, W The elucidation of somatostatin receptor functions: a current view. Rev Physiol Biochem Pharmacol 133:55-108 (1998)  
Target
Name:
Somatostatin receptor type 2
Synonyms:
SOMATOSTATIN SST2 SS2R Somatostatin receptor Somatostatin receptor type 2 | Sstr2
Type:
Enzyme Catalytic Domain
Mol. Mass.:
41212.21
Organism:
RAT
Description:
SOMATOSTATIN SST2 SSTR2 RAT::P30680
Residue:
369
  
Inhibitor
Name:
BDBM82465
Synonyms:
BIM 23023 D-Phe-L-Cys(1)-L-Tyr-D-Trp-L-Lys-L-Abu-L-Cys(1)-L-Thr-NH2
Type:
Small organic molecule
Emp. Form.:
C49H65N11O10S2
Mol. Mass.:
1032.238
SMILES:
CC[C@@H]1NC(=O)[C@H](CCCCN)NC(=O)[C@@H](Cc2c[nH]c3ccccc23)NC(=O)[C@H](Cc2ccc(O)cc2)NC(=O)[C@H](CSSC[C@H](NC1=O)C(=O)N[C@@H]([C@@H](C)O)C(N)=O)NC(=O)[C@H](N)Cc1ccccc1
: