Target
Somatostatin receptor type 2
Ligand
BDBM85080
Substrate
Ki
1000±n/a nM
Comments
PDSP_3367
Citation
 Meyerhof, W The elucidation of somatostatin receptor functions: a current view. Rev Physiol Biochem Pharmacol 133:55-108 (1998)  
Target
Name:
Somatostatin receptor type 2
Synonyms:
SOMATOSTATIN SST2 Smstr2 Somatostatin receptor 2 Sst2 | Sstr2
Type:
Enzyme Catalytic Domain
Mol. Mass.:
41234.26
Organism:
MOUSE
Description:
SOMATOSTATIN SST2 SSTR2 MOUSE::P30875
Residue:
369
  
Inhibitor
Name:
BDBM85080
Synonyms:
CH-275 L-Cys(1)-L-Lys-L-Phe-L-Phe-D-Trp-4-[(Isopropylamino)methyl]-L-Phe-L-Thr-L-Phe-L-Thr-L-Ser-L-Cys(1)-OH
Type:
Small organic molecule
Emp. Form.:
C74H96N14O15S2
Mol. Mass.:
1485.769
SMILES:
CC(C)NCc1ccc(C[C@H]2NC(=O)[C@H](Cc3c[nH]c4ccccc34)NC(=O)C(Cc3ccccc3)NC(=O)C(Cc3ccccc3)NC(=O)C(CCCCN)NC(=O)[C@H](N)CSSC[C@@H](NC(=O)[C@@H](CO)NC(=O)[C@@H](NC(=O)[C@@H](Cc3ccccc3)NC(=O)C(NC2=O)C(C)O)C(C)O)C(O)=O)cc1
: