Target
Somatostatin receptor type 5
Ligand
BDBM82463
Substrate
Ki
51±n/a nM
Comments
PDSP_1033
Citation
 Meyerhof, W The elucidation of somatostatin receptor functions: a current view. Rev Physiol Biochem Pharmacol 133:55-108 (1998)  
Target
Name:
Somatostatin receptor type 5
Synonyms:
SOMATOSTATIN SST5 Somatostatin receptor Sstr5
Type:
Enzyme Catalytic Domain
Mol. Mass.:
39986.50
Organism:
RAT
Description:
SOMATOSTATIN SST5 SSTR5 RAT::P30938
Residue:
363
  
Inhibitor
Name:
BDBM82463
Synonyms:
Cyclo[L-Trp-D-Trp-L-Lys-L-Thr-L-Phe-(7-amino*heptanoyl-L-Phe-)] L-362855
Type:
Small organic molecule
Emp. Form.:
C57H70N10O8
Mol. Mass.:
1023.2279
SMILES:
C[C@@H](O)[C@@H]1NC(=O)[C@H](CCCCN)NC(=O)[C@@H](Cc2c[nH]c3ccccc23)NC(=O)[C@H](Cc2c[nH]c3ccccc23)NC(=O)[C@H](Cc2ccccc2)NC(=O)CCCCCCNC(=O)[C@H](Cc2ccccc2)NC1=O
: