Target
Alpha-2A adrenergic receptor
Ligand
BDBM50019492
Substrate
Ki
0.62±n/a nM
Comments
PDSP_1648
Citation
 Jasper, JRLesnick, JDChang, LKYamanishi, SSChang, TKHsu, SADaunt, DABonhaus, DWEglen, RM Ligand efficacy and potency at recombinant alpha2 adrenergic receptors: agonist-mediated [35S]GTPgammaS binding. Biochem Pharmacol 55:1035-43 (1998)  
Target
Name:
Alpha-2A adrenergic receptor
Synonyms:
ADRA2A adrenergic Alpha2A
Type:
Enzyme Catalytic Domain
Mol. Mass.:
48888.08
Organism:
MOUSE
Description:
adrenergic Alpha2A ADRA2A MOUSE::Q01338
Residue:
450
  
Inhibitor
Name:
BDBM50019492
Synonyms:
(+)2-(2-Methoxy-2,3-dihydro-benzo[1,4]dioxin-2-yl)-4,5-dihydro-1H-imidazole 2-(2,3-dihydro-2-methoxy-1,4-benzodioxin-2-yl)-4,5-dihydro-1H-imidazole 2-(2-methoxy-2,3-dihydrobenzo[b][1,4]dioxin-2-yl)-4,5-dihydro-1H-imidazole CHEMBL10332 RX821002
Type:
Small organic molecule
Emp. Form.:
C12H14N2O3
Mol. Mass.:
234.2512
SMILES:
COC1(COc2ccccc2O1)C1=NCCN1
: