Target
Alpha-2B adrenergic receptor
Ligand
BDBM55436
Substrate
Ki
3162.28±n/a nM
Comments
PDSP_1893
Citation
 Jasper, JRLesnick, JDChang, LKYamanishi, SSChang, TKHsu, SADaunt, DABonhaus, DWEglen, RM Ligand efficacy and potency at recombinant alpha2 adrenergic receptors: agonist-mediated [35S]GTPgammaS binding. Biochem Pharmacol 55:1035-43 (1998)  
Target
Name:
Alpha-2B adrenergic receptor
Synonyms:
ADA2B_HUMAN ADRA2L1 Adrenergic alpha2B Adrenergic receptor alpha Alpha-2 adrenergic receptor subtype C2 Alpha-2B adrenoreceptor | Alpha-2BAR
Type:
Enzyme
Mol. Mass.:
49964.20
Organism:
Homo sapiens (Human)
Description:
P18089
Residue:
450
  
Inhibitor
Name:
BDBM55436
Synonyms:
2-(phenylmethyl)-4,5-dihydro-1H-imidazole;hydrochloride 2-benzyl-2-imidazoline;hydrochloride MLS000559484 Tolazoline | cid_6048
Type:
Small organic molecule
Emp. Form.:
C10H12N2
Mol. Mass.:
160.2157
SMILES:
C(C1=NCCN1)c1ccccc1
: