Target
Melatonin receptor type 1A
Ligand
BDBM50043289
Substrate
Ki
0.67±n/a nM
Comments
PDSP_1195
Citation
 Beresford, IJBrowning, CStarkey, SJBrown, JFoord, SMCoughlan, JNorth, PCDubocovich, MLHagan, RM GR196429: a nonindolic agonist at high-affinity melatonin receptors. J Pharmacol Exp Ther 285:1239-45 (1998) Target
Name:
Melatonin receptor type 1A
Synonyms:
MTNR1A MTR1A_HUMAN Mel1a melatonin receptor Melatonin receptor Melatonin receptor type 1 (MT1) | Melatonin receptor type 1A
Type:
Enzyme
Mol. Mass.:
39392.94
Organism:
Homo sapiens (Human)
Description:
P48039
Residue:
350
  
Inhibitor
Name:
BDBM50043289
Synonyms:
CHEMBL34730 N-[2-(6-Chloro-5-methoxy-1H-indol-3-yl)-ethyl]-acetamide(6-Chloromelatonin) | melatonin, 6-Chloro
Type:
Small organic molecule
Emp. Form.:
C13H15ClN2O2
Mol. Mass.:
266.723
SMILES:
COc1cc2c(CCNC(C)=O)c[nH]c2cc1Cl
: