Target
Melatonin receptor type 1A
Ligand
BDBM82509
Substrate
Ki
0.54±n/a nM
Comments
PDSP_1199
Citation
 Beresford, IJBrowning, CStarkey, SJBrown, JFoord, SMCoughlan, JNorth, PCDubocovich, MLHagan, RM GR196429: a nonindolic agonist at high-affinity melatonin receptors. J Pharmacol Exp Ther 285:1239-45 (1998) Target
Name:
Melatonin receptor type 1A
Synonyms:
MTNR1A MTR1A_HUMAN Mel1a melatonin receptor Melatonin receptor Melatonin receptor type 1 (MT1) | Melatonin receptor type 1A
Type:
Enzyme
Mol. Mass.:
39392.94
Organism:
Homo sapiens (Human)
Description:
P48039
Residue:
350
  
Inhibitor
Name:
BDBM82509
Synonyms:
Melatonin,6-Hydroxy | melatonin, 6-Hydroxy
Type:
Small organic molecule
Emp. Form.:
C13H16N2O3
Mol. Mass.:
248.2777
SMILES:
COc1cc2c(CCNC(C)=O)c[nH]c2cc1O
: