Target
Melatonin receptor type 1A
Ligand
BDBM29612
Substrate
Ki
79.43±n/a nM
Comments
PDSP_1708
Citation
 Beresford, IJBrowning, CStarkey, SJBrown, JFoord, SMCoughlan, JNorth, PCDubocovich, MLHagan, RM GR196429: a nonindolic agonist at high-affinity melatonin receptors. J Pharmacol Exp Ther 285:1239-45 (1998) Target
Name:
Melatonin receptor type 1A
Synonyms:
MTNR1A MTR1A_HUMAN Mel1a melatonin receptor Melatonin receptor Melatonin receptor type 1 (MT1) | Melatonin receptor type 1A
Type:
Enzyme
Mol. Mass.:
39392.94
Organism:
Homo sapiens (Human)
Description:
P48039
Residue:
350
  
Inhibitor
Name:
BDBM29612
Synonyms:
CHEMBL33103 JOH-MSK-a63bdd1d-4 N-Acetyl-5-hydroxytryptamine N-acetylserotonin Serotonin,N-acetyl
Type:
Small organic molecule
Emp. Form.:
C12H14N2O2
Mol. Mass.:
218.2518
SMILES:
CC(=O)NCCc1c[nH]c2ccc(O)cc12
: