Target
Somatostatin receptor type 4
Ligand
BDBM82467
Substrate
Ki
1.70±n/a nM
Comments
PDSP_489
Citation
 Siehler, SSeuwen, KHoyer, D [125I]Tyr10-cortistatin14 labels all five somatostatin receptors. Naunyn Schmiedebergs Arch Pharmacol 357:483-9 (1998)  
Target
Name:
Somatostatin receptor type 4
Synonyms:
SOMATOSTATIN SST4 SS4-R SSR4_HUMAN SSTR4 | Somatostatin receptor type 4 (SSTR4)
Type:
Enzyme
Mol. Mass.:
42015.38
Organism:
Homo sapiens (Human)
Description:
P31391
Residue:
388
  
Inhibitor
Name:
BDBM82467
Synonyms:
2-Deamino-L-Abu(1)-L-Lys-L-Asp(NH2)-L-Phe-L-Phe-L-Trp-L-Lys-L-Thr-L-Tyr-L-Thr-L-Ser-L-Abu(1)-OH CGP-23996
Type:
Small organic molecule
Emp. Form.:
C73H99N15O18
Mol. Mass.:
1474.6569
SMILES:
C[C@H](O)[C@@H]1NC(=O)C(CCCCN)NC(=O)[C@@H](Cc2c[nH]c3ccccc23)NC(=O)C(Cc2ccccc2)NC(=O)C(Cc2ccccc2)NC(=O)C(CC(N)=O)NC(=O)C(CCCCN)NC(=O)CCCCC[C@@H](NC(=O)[C@@H](CO)NC(=O)[C@H](NC(=O)[C@@H](Cc2ccc(O)cc2)NC1=O)[C@H](C)O)C(O)=O
: