Target
Somatostatin receptor type 5
Ligand
BDBM50051568
Substrate
Ki
0.72±n/a nM
Comments
PDSP_1701
Citation
 Siehler, SSeuwen, KHoyer, D [125I]Tyr10-cortistatin14 labels all five somatostatin receptors. Naunyn Schmiedebergs Arch Pharmacol 357:483-9 (1998)  
Target
Name:
Somatostatin receptor type 5
Synonyms:
SOMATOSTATIN SST5 SS5-R SSR5_HUMAN Somatostatin receptor type 5 (SSTR5)
Type:
Enzyme
Mol. Mass.:
39218.02
Organism:
Homo sapiens (Human)
Description:
P35346
Residue:
364
  
Inhibitor
Name:
BDBM50051568
Synonyms:
(3S,6S,9S,12R,15S,18S)-9-(4-Amino-butyl)-3-benzyl-15-(4-hydroxy-benzyl)-12-(1H-indol-3-ylmethyl)-6-isopropyl-1,18-dimethyl-1,4,7,10,13,16hexaaza-cyclooctadecane-2,5,8,11,14,17-hexaone seglitide
Type:
Small organic molecule
Emp. Form.:
C44H56N8O7
Mol. Mass.:
808.9648
SMILES:
CC(C)[C@@H]1NC(=O)[C@H](CCCCN)NC(=O)[C@@H](Cc2c[nH]c3ccccc23)NC(=O)[C@H](Cc2ccc(O)cc2)NC(=O)[C@H](C)N(C)C(=O)[C@H](Cc2ccccc2)NC1=O
: