Target
Somatostatin receptor type 2
Ligand
BDBM82253
Substrate
Ki
5.01±n/a nM
Comments
PDSP_382
Citation
 Siehler, SSeuwen, KHoyer, D [125I][Tyr3]octreotide labels human somatostatin sst2 and sst5 receptors. Eur J Pharmacol 348:311-20 (1998)  
Target
Name:
Somatostatin receptor type 2
Synonyms:
SOMATOSTATIN SST2 SS-2-R SS2R SSTR2 | Somatostatin receptor type 2 (SSTR2)
Type:
Enzyme
Mol. Mass.:
41344.94
Organism:
Homo sapiens (Human)
Description:
P30874
Residue:
369
  
Inhibitor
Name:
BDBM82253
Synonyms:
BIM 23052 | CAS_133073-82-2
Type:
Small organic molecule
Emp. Form.:
C61H75N11O10
Mol. Mass.:
1122.3159
SMILES:
C[C@@H](O)[C@H](NC(=O)[C@H](Cc1ccccc1)NC(=O)[C@@H](NC(=O)[C@H](CCCCN)NC(=O)[C@@H](Cc1c[nH]c2ccccc12)NC(=O)[C@H](Cc1ccccc1)NC(=O)[C@H](Cc1ccccc1)NC(=O)[C@H](N)Cc1ccccc1)[C@@H](C)O)C(N)=O
: