Target
Alpha-1B adrenergic receptor
Ligand
BDBM30712
Substrate
Ki
158.49±n/a nM
Comments
PDSP_1428
Citation
 Wikberg-Matsson, AWikberg, JEUhlén, S Characterization of alpha1-adrenoceptor subtypes in the pig. Eur J Pharmacol 347:301-9 (1998)  
Target
Name:
Alpha-1B adrenergic receptor
Synonyms:
ADRA1B | adrenergic Alpha1B
Type:
Enzyme Catalytic Domain
Mol. Mass.:
34826.67
Organism:
PIG
Description:
Q70HQ0
Residue:
316
  
Inhibitor
Name:
BDBM30712
Synonyms:
6-tert-butyl-3-(2-imidazolin-2-ylmethyl)-2,4-dimethyl-phenol;hydrochloride 6-tert-butyl-3-(4,5-dihydro-1H-imidazol-2-ylmethyl)-2,4-dimethylphenol;hydrochloride Oxymetazoline cid_66259
Type:
Small organic molecule
Emp. Form.:
C16H24N2O
Mol. Mass.:
260.3746
SMILES:
Cc1cc(c(O)c(C)c1CC1=NCCN1)C(C)(C)C
: