Target
Endothelin-1 receptor
Ligand
BDBM85335
Substrate
Ki
0.13±n/a nM
Comments
PDSP_1669
Citation
 Ohlstein, EHNambi, PHay, DWGellai, MBrooks, DPLuengo, JXiang, JNElliott, JD Nonpeptide endothelin receptor antagonists. XI. Pharmacological characterization of SB 234551, a high-affinity and selective nonpeptide ETA receptor antagonist. J Pharmacol Exp Ther 286:650-6 (1998) Target
Name:
Endothelin-1 receptor
Synonyms:
EDNRA ET-A ETA-R Endothelin receptor type A hET-AR
Type:
Enzyme Catalytic Domain
Mol. Mass.:
48736.88
Organism:
Homo sapiens (Human)
Description:
P25101
Residue:
427
  
Inhibitor
Name:
BDBM85335
Synonyms:
SB 234551 | SB-234551
Type:
Small organic molecule
Emp. Form.:
C34H34N2O9
Mol. Mass.:
614.6418
SMILES:
CCCCn1ncc(\C=C(/Cc2cc3OCOc3cc2OC)C(O)=O)c1-c1ccc(OC)cc1OCc1ccccc1C(O)=O
: