Target
Mu-type opioid receptor
Ligand
BDBM21025
Substrate
Ki
2.49±n/a nM
Comments
PDSP_615
Citation
 Goldberg, IERossi, GCLetchworth, SRMathis, JPRyan-Moro, JLeventhal, LSu, WEmmel, DBolan, EAPasternak, GW Pharmacological characterization of endomorphin-1 and endomorphin-2 in mouse brain. J Pharmacol Exp Ther 286:1007-13 (1998) Target
Name:
Mu-type opioid receptor
Synonyms:
M-OR-1 Mor OPRM_MOUSE Oprm | Oprm1
Type:
Enzyme Catalytic Domain
Mol. Mass.:
44431.62
Organism:
MOUSE
Description:
OPIATE Mu OPRM1 MOUSE::P42866
Residue:
398
  
Inhibitor
Name:
BDBM21025
Synonyms:
(2R)-2-[(2S)-2-{2-[(2R)-2-[(2S)-2-amino-3-(4-hydroxyphenyl)propanamido]propanamido]acetamido}-3-phenylpropanamido]-4-methylpentanoic acid BW-180C DADLE H-Tyr-D-Ala-Gly-Phe-D-Leu-OH | [D-Ala2-D-Leu5]enkephalin
Type:
ANALGESIC
Emp. Form.:
C29H39N5O7
Mol. Mass.:
569.6493
SMILES:
CC(C)C[C@@H](NC(=O)[C@H](Cc1ccccc1)NC(=O)CNC(=O)[C@@H](C)NC(=O)[C@@H](N)Cc1ccc(O)cc1)C(O)=O
: