Target
Somatostatin receptor type 4
Ligand
BDBM85357
Substrate
Ki
81±n/a nM
Comments
PDSP_7578
Citation
 Yang, LBerk, SCRohrer, SPMosley, RTGuo, LUnderwood, DJArison, BHBirzin, ETHayes, ECMitra, SWParmar, RMCheng, KWu, TJButler, BSFoor, FPasternak, APan, YSilva, MFreidinger, RMSmith, RGChapman, KSchaeffer, JMPatchett, AA Synthesis and biological activities of potent peptidomimetics selective for somatostatin receptor subtype 2. Proc Natl Acad Sci U S A 95:10836-41 (1998)  
Target
Name:
Somatostatin receptor type 4
Synonyms:
SOMATOSTATIN SST4 SS4-R SSR4_HUMAN SSTR4 | Somatostatin receptor type 4 (SSTR4)
Type:
Enzyme
Mol. Mass.:
42015.38
Organism:
Homo sapiens (Human)
Description:
P31391
Residue:
388
  
Inhibitor
Name:
BDBM85357
Synonyms:
2-[[(2R,3S)-2-[[4-[(2-Oxo-2,3-dihydro-1H-benzimidazole)-1-yl]piperidino]carbonylamino]-3-(1H-indole-3-yl)butyryl]amino]-6-aminohexanoic acid tert-butyl ester L-054522
Type:
Small organic molecule
Emp. Form.:
C35H47N7O5
Mol. Mass.:
645.7916
SMILES:
C[C@H]([C@@H](NC(=O)N1CCC(CC1)n1c2ccccc2[nH]c1=O)C(=O)NC(CCCCN)C(=O)OC(C)(C)C)c1c[nH]c2ccccc12
: