Target
Melatonin receptor type 1A
Ligand
BDBM85372
Substrate
Ki
0.29±n/a nM
Comments
PDSP_1246
Citation
 Spadoni, GBalsamini, CBedini, ADiamantini, GDi Giacomo, BTontini, ATarzia, GMor, MPlazzi, PVRivara, SNonno, RPannacci, MLucini, VFraschini, FStankov, BM 2-[N-Acylamino(C1-C3)alkyl]indoles as MT1 melatonin receptor partial agonists, antagonists, and putative inverse agonists. J Med Chem 41:3624-34 (1998)  
Target
Name:
Melatonin receptor type 1A
Synonyms:
MTNR1A MTR1A_HUMAN Mel1a melatonin receptor Melatonin receptor Melatonin receptor type 1 (MT1) | Melatonin receptor type 1A
Type:
Enzyme
Mol. Mass.:
39392.94
Organism:
Homo sapiens (Human)
Description:
P48039
Residue:
350
  
Inhibitor
Name:
BDBM85372
Synonyms:
CAS_121-75-5 Malathion
Type:
Small organic molecule
Emp. Form.:
C10H19O6PS2
Mol. Mass.:
330.358
SMILES:
CCOC(=O)CC(SP(=S)(OC)OC)C(=O)OCC
: