Target
Neuropeptide Y receptor type 2
Ligand
BDBM82281
Substrate
Ki
0.136±n/a nM
Comments
PDSP_1386
Citation
 Sharma, PHolmberg, SKEriksson, HBeck-Sickinger, AGGrundemar, LLarhammar, D Cloning and functional expression of the guinea pig neuropeptide Y Y2 receptor. Regul Pept 0:23-8 (1998)  
Target
Name:
Neuropeptide Y receptor type 2
Synonyms:
NPY-Y2 NPY2R_CAVPO | Neuropeptide Y receptor type 2
Type:
Enzyme Catalytic Domain
Mol. Mass.:
42344.53
Organism:
GUINEA PIG
Description:
NPY-Y2 NPY2R GUINEA PIG::Q9Z2D5
Residue:
381
  
Inhibitor
Name:
BDBM82281
Synonyms:
NPY22-36, porcine | NPY22-36, rat, human
Type:
Small organic molecule
Emp. Form.:
C85H139N29O21
Mol. Mass.:
1903.1949
SMILES:
CC[C@H](C)[C@H](NC(=O)[C@H](Cc1ccc(O)cc1)NC(=O)[C@H](Cc1cnc[nH]1)NC(=O)[C@H](CCCN=C(N)N)NC(=O)[C@H](CC(C)C)NC(=O)[C@H](C)NC(=O)[C@@H](N)CO)C(=O)N[C@@H](CC(N)=O)C(=O)N[C@@H](CC(C)C)C(=O)N[C@@H]([C@@H](C)CC)C(=O)N[C@@H]([C@@H](C)O)C(=O)N[C@@H](CCCN=C(N)N)C(=O)N[C@@H](CCC(N)=O)C(=O)N[C@@H](CCCN=C(N)N)C(=O)N[C@@H](Cc1ccc(O)cc1)C(N)=O
: