Target
Muscarinic acetylcholine receptor M4
Ligand
BDBM50176065
Substrate
Ki
0.58±n/a nM
Comments
PDSP_111
Citation
 Chelala, JLKilani, AMiller, MJMartin, RJErnsberger, P Muscarinic receptor binding sites of the M4 subtype in porcine lung parenchyma. Pharmacol Toxicol 83:200-7 (1998)  
Target
Name:
Muscarinic acetylcholine receptor M4
Synonyms:
ACM4_HUMAN Cholinergic, muscarinic M4 Muscarinic acetylcholine receptor M2 and M4
Type:
Enzyme Catalytic Domain
Mol. Mass.:
53079.31
Organism:
Homo sapiens (Human)
Description:
Cholinergic, muscarinic M4 CHRM4 HUMAN M3::P08173
Residue:
479
  
Inhibitor
Name:
BDBM50176065
Synonyms:
4-DAMP Acetic acid 4-[(4-acetoxy-phenyl)-pyridin-2-yl-methyl]-phenyl ester CHEMBL76897
Type:
Small organic molecule
Emp. Form.:
C21H26NO2
Mol. Mass.:
324.4361
SMILES:
C[N+]1(C)CCC(CC1)OC(=O)C(c1ccccc1)c1ccccc1
: