Target
Muscarinic acetylcholine receptor M4
Ligand
BDBM50015720
Substrate
Ki
0.38±n/a nM
Comments
PDSP_1688
Citation
 Chelala, JLKilani, AMiller, MJMartin, RJErnsberger, P Muscarinic receptor binding sites of the M4 subtype in porcine lung parenchyma. Pharmacol Toxicol 83:200-7 (1998)  
Target
Name:
Muscarinic acetylcholine receptor M4
Synonyms:
CHRM4 Cholinergic, muscarinic M4
Type:
Enzyme Catalytic Domain
Mol. Mass.:
30028.84
Organism:
bovine
Description:
A6QQE4
Residue:
271
  
Inhibitor
Name:
BDBM50015720
Synonyms:
(hyoscine)3-Hydroxy-2-phenyl-propionic acid 9-methyl-3-oxa-9-aza-tricyclo[3.3.1.0*2,4*]non-7-yl ester 9-methyl-3-oxa-9-azatricyclo[3.3.1.02,4]non-7-yl 3-hydroxy-2-phenylpropanoate CHEMBL13030 SCOPOLAMINE
Type:
Small organic molecule
Emp. Form.:
C17H21NO4
Mol. Mass.:
303.3529
SMILES:
CN1C2CC(CC1C1OC21)OC(=O)C(CO)c1ccccc1
: