Target
Muscarinic acetylcholine receptor M2
Ligand
BDBM50003359
Substrate
Ki
125.89±n/a nM
Comments
PDSP_3206
Citation
 Watson, JBrough, SColdwell, MCGager, THo, MHunter, AJJerman, JMiddlemiss, DNRiley, GJBrown, AM Functional effects of the muscarinic receptor agonist, xanomeline, at 5-HT1 and 5-HT2 receptors. Br J Pharmacol 125:1413-20 (1998)  
Target
Name:
Muscarinic acetylcholine receptor M2
Synonyms:
ACM2_HUMAN Cholinergic, muscarinic M2 Muscarinic acetylcholine receptor M2 and M5 | RecName: Full=Muscarinic acetylcholine receptor M2
Type:
GPCR
Mol. Mass.:
51730.61
Organism:
Homo sapiens (Human)
Description:
P08172
Residue:
466
  
Inhibitor
Name:
BDBM50003359
Synonyms:
5-(4-Hexyloxy-[1,2,5]thiadiazol-3-yl)-1-methyl-1,2,3,6-tetrahydro-pyridine; oxalic acid CHEMBL21536 LY 246708 | Xanomeline
Type:
Small organic molecule
Emp. Form.:
C14H23N3OS
Mol. Mass.:
281.417
SMILES:
CCCCCCOc1nsnc1C1=CCCN(C)C1
: