Target
Sodium channel protein type 9 subunit alpha
Ligand
BDBM275850
Substrate
Meas. Tech.
Binding Assay
pH
7.4±n/a
Temperature
298.15±n/a K
IC50
950±n/a nM
Comments
extracted
Citation
 Dehnhardt, CMChowdhury, SFocken, TGrimwood, MEHemeon, IWSafina, BSutherlin, DP N-substituted benzamides and methods of use thereof US Patent  US10071957 Publication Date 9/11/2018 
Target
Name:
Sodium channel protein type 9 subunit alpha
Synonyms:
NENA Peripheral sodium channel 1 SCN9A_HUMAN Voltage-gated sodium channel subunit Nav1.7 hNE-Na
Type:
Protein
Mol. Mass.:
226375.97
Organism:
Homo sapiens (Human)
Description:
Q15858
Residue:
1988
  
Inhibitor
Name:
BDBM275850
Synonyms:
5-chloro-4-((5-chloro- 6-(2,2,3,3-tetrafluoro- propoxy)pyridin-3- yl)oxy)-2-fluoro-N- (pyridin-3-ylsulfonyl) benzamide | US10071957, Example 69
Type:
Small organic molecule
Emp. Form.:
C20H12Cl2F5N3O5S
Mol. Mass.:
572.289
SMILES:
FC(F)C(F)(F)COc1ncc(Oc2cc(F)c(cc2Cl)C(=O)NS(=O)(=O)c2cccnc2)cc1Cl
: