Target
Sodium channel protein type 5 subunit alpha
Ligand
BDBM275867
Substrate
Meas. Tech.
Electrophysiological Assay (In Vitro Assay)
pH
7.2±n/a
IC50
>10000±n/a nM
Comments
extracted
Citation
 Dehnhardt, CMChowdhury, SFocken, TGrimwood, MEHemeon, IWSafina, BSutherlin, DP N-substituted benzamides and methods of use thereof US Patent  US10071957 Publication Date 9/11/2018 
Target
Name:
Sodium channel protein type 5 subunit alpha
Synonyms:
HH1 SCN5A_HUMAN Sodium channel protein type 5 subunit alpha/beta-1/beta-2 Voltage-gated sodium channel subunit alpha Nav1.5
Type:
Enzyme
Mol. Mass.:
226908.60
Organism:
Homo sapiens (Human)
Description:
Q14524
Residue:
2016
  
Inhibitor
Name:
BDBM275867
Synonyms:
US10071957, Example 86
Type:
Small organic molecule
Emp. Form.:
C24H25ClN4O6S
Mol. Mass.:
532.997
SMILES:
COc1ncccc1-c1cc(ccc1Oc1cnc(OC(C)C)c(Cl)c1)C(=O)NS(=O)(=O)N1CCC1
: