Target
Sodium channel protein type 9 subunit alpha
Ligand
BDBM275867
Substrate
Meas. Tech.
Binding Assay
pH
7.4±n/a
Temperature
298.15±n/a K
IC50
11.0±n/a nM
Comments
extracted
Citation
 Dehnhardt, CMChowdhury, SFocken, TGrimwood, MEHemeon, IWSafina, BSutherlin, DP N-substituted benzamides and methods of use thereof US Patent  US10071957 Publication Date 9/11/2018 
Target
Name:
Sodium channel protein type 9 subunit alpha
Synonyms:
NENA Peripheral sodium channel 1 SCN9A_HUMAN Voltage-gated sodium channel subunit Nav1.7 hNE-Na
Type:
Protein
Mol. Mass.:
226375.97
Organism:
Homo sapiens (Human)
Description:
Q15858
Residue:
1988
  
Inhibitor
Name:
BDBM275867
Synonyms:
US10071957, Example 86
Type:
Small organic molecule
Emp. Form.:
C24H25ClN4O6S
Mol. Mass.:
532.997
SMILES:
COc1ncccc1-c1cc(ccc1Oc1cnc(OC(C)C)c(Cl)c1)C(=O)NS(=O)(=O)N1CCC1
: