Target
5-hydroxytryptamine receptor 2B
Ligand
BDBM82479
Substrate
Ki
12±n/a nM
Comments
PDSP_1408
Citation
 Bymaster, FPNelson, DLDeLapp, NWFalcone, JFEckols, KTruex, LLForeman, MMLucaites, VLCalligaro, DO Antagonism by olanzapine of dopamine D1, serotonin2, muscarinic, histamine H1 and alpha 1-adrenergic receptors in vitro. Schizophr Res 37:107-22 (1999)  
Target
Name:
5-hydroxytryptamine receptor 2B
Synonyms:
5-HT-2B 5-hydroxytryptamine (serotonin) receptor 2B [Homo sapiens] 5-hydroxytryptamine receptor 2C (5HT2C) HTR2B Serotonin 2b (5-HT2b) receptor | Serotonin Receptor 2B
Type:
G Protein-Coupled Receptor (GPCR)
Mol. Mass.:
54312.47
Organism:
Homo sapiens (Human)
Description:
Receptor binding assays were performed using human clone stably expressed in CHO cells.
Residue:
481
  
Inhibitor
Name:
BDBM82479
Synonyms:
CAS_132539-06-1 OLANZAPINE | USRE49340, Rank 2
Type:
Small organic molecule
Emp. Form.:
C17H20N4S
Mol. Mass.:
312.432
SMILES:
CN1CCN(CC1)C1=c2cc(C)sc2=Nc2ccccc2N1
: