Target
Sodium-dependent serotonin transporter
Ligand
BDBM22166
Substrate
Ki
4.2±n/a nM
Comments
PDSP_1641
Citation
 Damaj, MISlemmer, JECarroll, FIMartin, BR Pharmacological characterization of nicotine's interaction with cocaine and cocaine analogs. J Pharmacol Exp Ther 289:1229-36 (1999) Target
Name:
Sodium-dependent serotonin transporter
Synonyms:
5-HT Transporter 5HT transporter Anandamid membrane transporter, AMT Monoamine transporters; Norepinephrine & serotonin Slc6a4 Sodium-dependent serotonin transporter (SERT) | imipramine receptor
Type:
Multi-pass membrane protein
Mol. Mass.:
70168.43
Organism:
Rattus norvegicus (rat)
Description:
P31652
Residue:
630
  
Inhibitor
Name:
BDBM22166
Synonyms:
3-(4-iodophenyl)tropane-2-carboxylic acid methyl ester CHEMBL215376 RTI-258 [125I]RTI-55 | methyl (1R,2S,3S,5S)-3-(4-iodophenyl)-8-methyl-8-azabicyclo[3.2.1]octane-2-carboxylate
Type:
radiolabeled ligand
Emp. Form.:
C16H20INO2
Mol. Mass.:
385.24
SMILES:
[H][C@]12CC[C@]([H])([C@H]([C@H](C1)c1ccc(I)cc1)C(=O)OC)N2C
: