Target
Norepinephrine transporter
Ligand
BDBM22396
Substrate
Ki
920±n/a nM
Comments
PDSP_1960
Citation
 Damaj, MISlemmer, JECarroll, FIMartin, BR Pharmacological characterization of nicotine's interaction with cocaine and cocaine analogs. J Pharmacol Exp Ther 289:1229-36 (1999) Target
Name:
Norepinephrine transporter
Synonyms:
Type:
Enzyme Catalytic Domain
Mol. Mass.:
2082.45
Organism:
RAT
Description:
Norepinephrine transporter 0 RAT::Q9JIA2
Residue:
19
MLLARMKPQVQPELGGADQ
  
Inhibitor
Name:
BDBM22396
Synonyms:
(1R,2S,3S,5S)-3-(4-chlorophenyl)-2-[5-(4-fluorophenyl)-1,3-thiazol-2-yl]-8-methyl-8-azabicyclo[3.2.1]octane WIN35,065-2 methyl (1R,2S,3S,5S)-8-methyl-3-phenyl-8-azabicyclo[3.2.1]octane-2-carboxylate | troparil, 1R-(exo,exo)-isomer
Type:
Small organic molecule
Emp. Form.:
C16H21NO2
Mol. Mass.:
259.3434
SMILES:
COC(=O)[C@@H]1[C@H]2CC[C@@H](C[C@@H]1c1ccccc1)N2C
: