Target
Trypanothione reductase
Ligand
BDBM41947
Substrate
Meas. Tech.
Inhibition Assay
pH
7.8±0
Temperature
298.15±0 K
IC50
6.0e+4±n/a nM
Citation
 Fournet, AInchausti, AYaluff, GRojas De Arias, AGuinaudeau, HBruneton, JBreidenbach, MAKarplus, PAFaerman, CH Trypanocidal bisbenzylisoquinoline alkaloids are inhibitors of trypanothione reductase. J Enzym Inhib 13:1-9 (1998)  
Target
Name:
Trypanothione reductase
Synonyms:
N(1),N(8)-bis(glutathionyl)spermidine reductase TYTR_CRIFA | Trypanothione Reductase (TR)
Type:
Protein
Mol. Mass.:
53225.75
Organism:
Crithidia fasciculata
Description:
P39040
Residue:
491
  
Inhibitor
Name:
BDBM41947
Synonyms:
(-)-BEBEERINE SMR000058852 cid_253793
Type:
Small organic molecule
Emp. Form.:
C36H38N2O6
Mol. Mass.:
594.6967
SMILES:
[H][C@@]12Cc3ccc(Oc4c(O)c(OC)cc5CCN(C)[C@]([H])(Cc6ccc(O)c(Oc7cc1c(CCN2C)cc7OC)c6)c45)cc3
: