Target
Bombesin
Ligand
BDBM85481
Substrate
Ki
79±n/a nM
Comments
PDSP_893
Citation
 Katsuno, TPradhan, TKRyan, RRMantey, SAHou, WDonohue, PJAkeson, MASpindel, ERBattey, JFCoy, DHJensen, RT Pharmacology and cell biology of the bombesin receptor subtype 4 (BB4-R). Biochemistry 38:7307-20 (1999)  
Target
Name:
Bombesin
Synonyms:
BOMB_BOMVA | Bombesin 4
Type:
Enzyme Catalytic Domain
Mol. Mass.:
12340.04
Organism:
Frog
Description:
Bombesin 4 0 Frog::P84213
Residue:
107
  
Inhibitor
Name:
BDBM85481
Synonyms:
CAS_93755-85-2 | GRP
Type:
Small organic molecule
Emp. Form.:
C130H204N38O31S2
Mol. Mass.:
2859.377
SMILES:
CSCCC(NC(=O)C(CC(C)C)NC(=O)C(Cc1cnc[nH]1)NC(=O)CNC(=O)C(NC(=O)C(C)NC(=O)C(Cc1c[nH]c2ccccc12)NC(=O)C(Cc1cnc[nH]1)NC(=O)C(CC(N)=O)NC(=O)CNC(=O)C(CCCN=C(N)N)NC(=O)C1CCCN1C(=O)C(Cc1ccc(O)cc1)NC(=O)C(CCSC)NC(=O)C(CCCCN)NC(=O)C(NC(=O)C(CC(C)C)NC(=O)C(NC(=O)C(NC(=O)CNC(=O)CNC(=O)CNC(=O)C(C)NC(=O)C1CCCN1C(=O)C(CC(C)C)NC(=O)C1CCCN1C(=O)C(N)C(C)C)C(C)O)C(C)C)C(C)O)C(C)C)C(N)=O
: