Target
Gastrin-releasing peptide receptor
Ligand
BDBM85504
Substrate
Ki
>10000±n/a nM
Comments
PDSP_1777
Citation
 Katsuno, TPradhan, TKRyan, RRMantey, SAHou, WDonohue, PJAkeson, MASpindel, ERBattey, JFCoy, DHJensen, RT Pharmacology and cell biology of the bombesin receptor subtype 4 (BB4-R). Biochemistry 38:7307-20 (1999)  
Target
Name:
Gastrin-releasing peptide receptor
Synonyms:
GRPR_RAT Gastrin-releasing peptide receptor | Grpr
Type:
Enzyme Catalytic Domain
Mol. Mass.:
43227.55
Organism:
RAT
Description:
Gastrin-Releasing peptide 0 RAT::P52500
Residue:
384
  
Inhibitor
Name:
BDBM85504
Synonyms:
Substance P,[DArg1,DTrp7,9,Leu11]
Type:
Small organic molecule
Emp. Form.:
C72H101N17O13
Mol. Mass.:
1412.6784
SMILES:
CC(C)C[C@H](NC(=O)[C@H](CC(C)C)NC(=O)[C@H](Cc1c[nH]c2ccccc12)NC(=O)[C@H](Cc1ccccc1)NC(=O)[C@@H](Cc1c[nH]c2ccccc12)NC(=O)[C@H](CCC(N)=O)NC(=O)[C@H](CCC(N)=O)NC(=O)[C@@H]1CCCN1C(=O)[C@H](CCCCN)NC(=O)[C@@H]1CCCN1C(=O)[C@@H](C)N)C(N)=O
: