Target
Prostaglandin G/H synthase 1
Ligand
BDBM50027952
Substrate
Ki
430±n/a nM
Comments
PDSP_4467
Citation
 Warner, TDGiuliano, FVojnovic, IBukasa, AMitchell, JAVane, JR Nonsteroid drug selectivities for cyclo-oxygenase-1 rather than cyclo-oxygenase-2 are associated with human gastrointestinal toxicity: a full in vitro analysis. Proc Natl Acad Sci U S A 96:7563-8 (1999)  
Target
Name:
Prostaglandin G/H synthase 1
Synonyms:
COX-1 Cyclooxygenase Cyclooxygenase-1 (COX-1) PTGS1 | Prostaglandin G/H synthase (cyclooxygenase)
Type:
Enzyme
Mol. Mass.:
68692.62
Organism:
Homo sapiens (Human)
Description:
P23219
Residue:
599
  
Inhibitor
Name:
BDBM50027952
Synonyms:
5-(4-chlorobenzoyl)-1,4-dimethyl-1H-pyrrole-2-acetic acid Zomepirac | [5-(4-chlorobenzoyl)-1,4-dimethyl-1H-pyrrol-2-yl]acetic acid
Type:
Small organic molecule
Emp. Form.:
C15H14ClNO3
Mol. Mass.:
291.73
SMILES:
Cc1cc(CC(O)=O)n(C)c1C(=O)c1ccc(Cl)cc1
: