Target
Prostaglandin G/H synthase 2
Ligand
BDBM50134036
Substrate
Ki
1300±n/a nM
Comments
PDSP_4460
Citation
 Warner, TDGiuliano, FVojnovic, IBukasa, AMitchell, JAVane, JR Nonsteroid drug selectivities for cyclo-oxygenase-1 rather than cyclo-oxygenase-2 are associated with human gastrointestinal toxicity: a full in vitro analysis. Proc Natl Acad Sci U S A 96:7563-8 (1999)  
Target
Name:
Prostaglandin G/H synthase 2
Synonyms:
COX2 Cyclooxygenase 2 (COX-2) Cyclooxygenase-2 (COX-2 AA) Cyclooxygenase-2 (COX-2) PGH2_HUMAN PHS II Prostaglandin E synthase/G/H synthase 2 Prostaglandin-endoperoxide synthase 2
Type:
Enzyme
Mol. Mass.:
69003.89
Organism:
Homo sapiens (Human)
Description:
Recombinant Cox-2 provided by Cayman (Cayman Chemical Co.,Ann Arbor, MI).
Residue:
604
  
Inhibitor
Name:
BDBM50134036
Synonyms:
2-(2,3-Dimethyl-phenylamino)-benzoic acid 2-(2,3-dimethylphenylamino)benzoic acid CI-473 INF-3355 Ponstel mefanamic acid
Type:
Small organic molecule
Emp. Form.:
C15H15NO2
Mol. Mass.:
241.2851
SMILES:
Cc1cccc(Nc2ccccc2C(O)=O)c1C
: