Target
Prostaglandin G/H synthase 2
Ligand
BDBM26197
Substrate
Ki
>10000±n/a nM
Comments
PDSP_4476
Citation
 Warner, TDGiuliano, FVojnovic, IBukasa, AMitchell, JAVane, JR Nonsteroid drug selectivities for cyclo-oxygenase-1 rather than cyclo-oxygenase-2 are associated with human gastrointestinal toxicity: a full in vitro analysis. Proc Natl Acad Sci U S A 96:7563-8 (1999)  
Target
Name:
Prostaglandin G/H synthase 2
Synonyms:
COX2 Cyclooxygenase 2 (COX-2) Cyclooxygenase-2 (COX-2 AA) Cyclooxygenase-2 (COX-2) PGH2_HUMAN PHS II Prostaglandin E synthase/G/H synthase 2 Prostaglandin-endoperoxide synthase 2
Type:
Enzyme
Mol. Mass.:
69003.89
Organism:
Homo sapiens (Human)
Description:
Recombinant Cox-2 provided by Cayman (Cayman Chemical Co.,Ann Arbor, MI).
Residue:
604
  
Inhibitor
Name:
BDBM26197
Synonyms:
CHEMBL112 Norco US9333197, Acetaminophen phenol derivative, 11
Type:
Small organic molecule
Emp. Form.:
C8H9NO2
Mol. Mass.:
151.1626
SMILES:
CC(=O)Nc1ccc(O)cc1
: