Target
D(2) dopamine receptor
Ligand
BDBM50069447
Substrate
Ki
180±n/a nM
Comments
PDSP_1303
Citation
 Sánchez, CHyttel, J Comparison of the effects of antidepressants and their metabolites on reuptake of biogenic amines and on receptor binding. Cell Mol Neurobiol 19:467-89 (1999)  
Target
Name:
D(2) dopamine receptor
Synonyms:
DOPAMINE D2 DOPAMINE D2 Short Dopamine D2 receptor Drd2
Type:
G Protein-Coupled Receptor (GPCR)
Mol. Mass.:
50931.60
Organism:
Rattus norvegicus (rat)
Description:
P61169
Residue:
444
  
Inhibitor
Name:
BDBM50069447
Synonyms:
1-(3-(4-(m-Chlorophenyl)-1-piperazinyl)propyl)-3-ethyl-4-(2-phenoxyethyl)-delta2-1,2,4-triazolin-5-one CHEMBL623 US9138393, Nefazodone HCl | US9144538, Nefazodone HCl
Type:
Small organic molecule
Emp. Form.:
C25H32ClN5O2
Mol. Mass.:
470.007
SMILES:
CCc1nn(CCCN2CCN(CC2)c2cccc(Cl)c2)c(=O)n1CCOc1ccccc1
: