Target
Somatostatin receptor type 2
Ligand
BDBM85521
Substrate
Ki
0.05±n/a nM
Comments
PDSP_3369
Citation
 Patel, YC Somatostatin and its receptor family. Front Neuroendocrinol 20:157-98 (1999)  
Target
Name:
Somatostatin receptor type 2
Synonyms:
SOMATOSTATIN SST2 SS-2-R SS2R SSTR2 | Somatostatin receptor type 2 (SSTR2)
Type:
Enzyme
Mol. Mass.:
41344.94
Organism:
Homo sapiens (Human)
Description:
P30874
Residue:
369
  
Inhibitor
Name:
BDBM85521
Synonyms:
CAS_5311372 NSC_5311372
Type:
Small organic molecule
Emp. Form.:
C33H43N7O3
Mol. Mass.:
585.7396
SMILES:
CC(C(NC(=O)N1CCC(CC1)n1c2ccccc2[nH]c1=O)C(=O)NCC1CCCC(CN)C1)c1c[nH]c2ccccc12
: