Target
Adenosine receptor A2a
Ligand
BDBM85523
Substrate
Ki
2±n/a nM
Comments
PDSP_2455
Citation
 Klotz, KNCamaioni, EVolpini, RKachler, SVittori, SCristalli, G 2-Substituted N-ethylcarboxamidoadenosine derivatives as high-affinity agonists at human A3 adenosine receptors. Naunyn Schmiedebergs Arch Pharmacol 360:103-8 (1999)  
Target
Name:
Adenosine receptor A2a
Synonyms:
A2A adenosine receptor (hA2A) ADENOSINE A2 ADORA2 Adenosine A2A receptor (A2AAR)
Type:
G Protein-Coupled Receptor (GPCR)
Mol. Mass.:
44716.46
Organism:
Homo sapiens (Human)
Description:
P29274
Residue:
412
  
Inhibitor
Name:
BDBM85523
Synonyms:
6S, (S)-PHPNECA
Type:
Small organic molecule
Emp. Form.:
C21H22N6O5
Mol. Mass.:
438.4366
SMILES:
CCNC(=O)C1OC(C(O)C1O)n1cnc2c(N)nc(nc12)C#C[C@H](O)c1ccccc1
: