Target
5-hydroxytryptamine receptor 2A
Ligand
BDBM50005257
Substrate
Ki
1.51±n/a nM
Comments
PDSP_706
Citation
 Porter, RHBenwell, KRLamb, HMalcolm, CSAllen, NHRevell, DFAdams, DRSheardown, MJ Functional characterization of agonists at recombinant human 5-HT2A, 5-HT2B and 5-HT2C receptors in CHO-K1 cells. Br J Pharmacol 128:13-20 (1999)  
Target
Name:
5-hydroxytryptamine receptor 2A
Synonyms:
5-HT-2 5-HT2A 5-hydroxytryptamine receptor 2A (5HT-2A) 5HT2A_HUMAN HTR2A | Serotonin receptor 2A
Type:
undefined
Mol. Mass.:
52607.65
Organism:
Homo sapiens (Human)
Description:
P28223
Residue:
471
  
Inhibitor
Name:
BDBM50005257
Synonyms:
(+)-2-(4-Bromo-2,5-dimethoxy-phenyl)-1-methyl-ethylamine (+/-)2-(4-Bromo-2,5-dimethoxy-phenyl)-1-methyl-ethylamine (-)2-(4-Bromo-2,5-dimethoxy-phenyl)-1-methyl-ethylamine 2-(2-Methoxy-phenyl)-1-methyl-ethylamine 2-(4-Bromo-2,5-dimethoxy-phenyl)-1-methyl-ethylamine((-)-DOB) 2-(4-Bromo-2,5-dimethoxy-phenyl)-1-methyl-ethylamine((S)-(+)-DOB) 2-(4-Bromo-2,5-dimethoxy-phenyl)-1-methyl-ethylamine[R(-)DOB] Brolamfetamine DOB | Racemic DOB
Type:
Small organic molecule
Emp. Form.:
C11H16BrNO2
Mol. Mass.:
274.154
SMILES:
COc1cc(CC(C)N)c(OC)cc1Br
: