Target
Somatostatin receptor type 1
Ligand
BDBM85246
Substrate
Ki
0.24±n/a nM
Comments
PDSP_590
Citation
 Siehler, SSeuwen, KHoyer, D Characterisation of human recombinant somatostatin receptors. 1. Radioligand binding studies. Naunyn Schmiedebergs Arch Pharmacol 360:488-99 (1999)  
Target
Name:
Somatostatin receptor type 1
Synonyms:
SOMATOSTATIN SST1 SS-1-R SS1R SSTR1 | Somatostatin receptor type 1 (SSTR1)
Type:
Enzyme
Mol. Mass.:
42692.81
Organism:
Homo sapiens (Human)
Description:
P30872
Residue:
391
  
Inhibitor
Name:
BDBM85246
Synonyms:
CST17 Cortistatin-17 | L-Asp-L-Arg-L-Met-L-Pro-L-Cys(1)-L-Arg-L-Asn-L-Phe-L-Phe-L-Trp-L-Lys-L-Thr-L-Phe-L-Ser-L-Ser-L-Cys(1)-L-Lys-OH
Type:
Small organic molecule
Emp. Form.:
C96H139N27O24S3
Mol. Mass.:
2151.492
SMILES:
CSCC[C@H](NC(=O)[C@H](CCCN=C(N)N)NC(=O)[C@@H](N)CC(O)=O)C(=O)N1CCC[C@H]1C(=O)N[C@H]1CSSC[C@H](NC(=O)[C@H](CO)NC(=O)[C@H](CO)NC(=O)[C@H](Cc2ccccc2)NC(=O)[C@@H](NC(=O)[C@H](CCCCN)NC(=O)[C@H](Cc2c[nH]c3ccccc23)NC(=O)[C@H](Cc2ccccc2)NC(=O)[C@H](Cc2ccccc2)NC(=O)[C@H](CC(N)=O)NC(=O)[C@H](CCCN=C(N)N)NC1=O)[C@@H](C)O)C(=O)N[C@@H](CCCCN)C(O)=O
: