Target
Somatostatin receptor type 3
Ligand
BDBM82463
Substrate
Ki
5.62±n/a nM
Comments
PDSP_1033
Citation
 Siehler, SSeuwen, KHoyer, D Characterisation of human recombinant somatostatin receptors. 1. Radioligand binding studies. Naunyn Schmiedebergs Arch Pharmacol 360:488-99 (1999)  
Target
Name:
Somatostatin receptor type 3
Synonyms:
SOMATOSTATIN SST3 SS3-R SSR-28 SSTR3 | Somatostatin receptor type 3 (SSTR3)
Type:
Protein
Mol. Mass.:
45855.97
Organism:
Homo sapiens (Human)
Description:
P32745
Residue:
418
  
Inhibitor
Name:
BDBM82463
Synonyms:
Cyclo[L-Trp-D-Trp-L-Lys-L-Thr-L-Phe-(7-amino*heptanoyl-L-Phe-)] L-362855
Type:
Small organic molecule
Emp. Form.:
C57H70N10O8
Mol. Mass.:
1023.2279
SMILES:
C[C@@H](O)[C@@H]1NC(=O)[C@H](CCCCN)NC(=O)[C@@H](Cc2c[nH]c3ccccc23)NC(=O)[C@H](Cc2c[nH]c3ccccc23)NC(=O)[C@H](Cc2ccccc2)NC(=O)CCCCCCNC(=O)[C@H](Cc2ccccc2)NC1=O
: