Target
Somatostatin receptor type 3
Ligand
BDBM85323
Substrate
Ki
0.08±n/a nM
Comments
PDSP_1119
Citation
 Siehler, SSeuwen, KHoyer, D Characterisation of human recombinant somatostatin receptors. 1. Radioligand binding studies. Naunyn Schmiedebergs Arch Pharmacol 360:488-99 (1999)  
Target
Name:
Somatostatin receptor type 3
Synonyms:
SOMATOSTATIN SST3 SS3-R SSR-28 SSTR3 | Somatostatin receptor type 3 (SSTR3)
Type:
Protein
Mol. Mass.:
45855.97
Organism:
Homo sapiens (Human)
Description:
P32745
Residue:
418
  
Inhibitor
Name:
BDBM85323
Synonyms:
LTT-SRIF28 | SRIF28-Leu8,D-Trp22,Tyr25
Type:
Small organic molecule
Emp. Form.:
C139H211N41O40S2
Mol. Mass.:
3160.543
SMILES:
CC(C)CC[C@H](NC(=O)[C@H](C)NC(=O)[C@@H]1CCCN1C(=O)[C@H](CC(N)=O)NC(=O)[C@H](CO)NC(=O)[C@H](CC(N)=O)NC(=O)[C@H](C)NC(=O)[C@@H](N)CO)C(=O)N[C@@H](C)C(=O)N1CCC[C@H]1C(=O)N[C@@H](CCCN=C(N)N)C(=O)N[C@@H](CCC(O)=O)C(=O)N[C@@H](CCCN=C(N)N)C(=O)N[C@@H](CCCCN)C(=O)N[C@@H](C)C(=O)NCC(=O)N[C@@H]1CSSC[C@H](NC(=O)[C@H](CO)NC(=O)[C@H](NC(=O)[C@H](Cc2ccc(O)cc2)NC(=O)[C@H](NC(=O)[C@H](CCCCN)NC(=O)[C@H](Cc2c[nH]c3ccccc23)NC(=O)[C@H](Cc2ccccc2)NC(=O)[C@@H](Cc2ccccc2)NC(=O)[C@H](CC(N)=O)NC(=O)[C@@H](CCCCN)NC1=O)[C@@H](C)O)[C@@H](C)O)C(O)=O
: