Target
5-hydroxytryptamine receptor 1B
Ligand
BDBM10755
Substrate
Ki
2.51±n/a nM
Comments
PDSP_150
Citation
 Millan, MJNewman-Tancredi, AAudinot, VCussac, DLejeune, FNicolas, JPCogé, FGalizzi, JPBoutin, JARivet, JMDekeyne, AGobert, A Agonist and antagonist actions of yohimbine as compared to fluparoxan at alpha(2)-adrenergic receptors (AR)s, serotonin (5-HT)(1A), 5-HT(1B), 5-HT(1D) and dopamine D(2) and D(3) receptors. Significance for the modulation of frontocortical monoaminergic transmission and depressive states. Synapse 35:79-95 (2000)  
Target
Name:
5-hydroxytryptamine receptor 1B
Synonyms:
5-HT1B HTR1B
Type:
Enzyme Catalytic Domain
Mol. Mass.:
43125.84
Organism:
GUINEA PIG
Description:
5-HT1B HTR1B GUINEA PIG::O08892
Residue:
389
  
Inhibitor
Name:
BDBM10755
Synonyms:
14C-5-hydroxy tryptamine creatinine disulfate 5-HT 5-hydroxy tryptamine creatinine disulfate Serotonin | [3H]-5-HT
Type:
Small organic molecule
Emp. Form.:
C10H12N2O
Mol. Mass.:
176.2151
SMILES:
NCCc1c[nH]c2ccc(O)cc12
: