Target
Hematopoietic prostaglandin D synthase
Ligand
BDBM50101824
Substrate
Ki
>10000±n/a nM
Comments
PDSP_4306
Citation
 Abramovitz, MAdam, MBoie, YCarrière, MDenis, DGodbout, CLamontagne, SRochette, CSawyer, NTremblay, NMBelley, MGallant, MDufresne, CGareau, YRuel, RJuteau, HLabelle, MOuimet, NMetters, KM The utilization of recombinant prostanoid receptors to determine the affinities and selectivities of prostaglandins and related analogs. Biochim Biophys Acta 1483:285-93 (2000)  
Target
Name:
Hematopoietic prostaglandin D synthase
Synonyms:
GSTS Glutathione-requiring prostaglandin D synthase HPGDS Hematopoietic prostaglandin D synthase Hematopoietic prostaglandin D synthase (HPGDS) PTGDS2 Prostaglandin D Synthase
Type:
Enzyme
Mol. Mass.:
23341.07
Organism:
Homo sapiens (Human)
Description:
The protein was expressed in E. coli strain BL21(DE3) with an N-terminal 6-His tag.
Residue:
199
  
Inhibitor
Name:
BDBM50101824
Synonyms:
7-{(1R,3R)-3-Hydroxy-2-[(E)-(S)-4-hydroxy-4-(1-propyl-cyclobutyl)-but-1-enyl]-5-oxo-cyclopentyl}-heptanoic acid methyl ester Butaprost (Methyl Ester) | CHEMBL432522
Type:
Small organic molecule
Emp. Form.:
C24H40O5
Mol. Mass.:
408.5714
SMILES:
CCCC1(CCC1)[C@@H](O)C\C=C\C1[C@H](O)CC(=O)[C@@H]1CCCCCCC(=O)OC
: