Target
Hematopoietic prostaglandin D synthase
Ligand
BDBM50008781
Substrate
Ki
>10000±n/a nM
Comments
PDSP_1747
Citation
 Abramovitz, MAdam, MBoie, YCarrière, MDenis, DGodbout, CLamontagne, SRochette, CSawyer, NTremblay, NMBelley, MGallant, MDufresne, CGareau, YRuel, RJuteau, HLabelle, MOuimet, NMetters, KM The utilization of recombinant prostanoid receptors to determine the affinities and selectivities of prostaglandins and related analogs. Biochim Biophys Acta 1483:285-93 (2000)  
Target
Name:
Hematopoietic prostaglandin D synthase
Synonyms:
GSTS Glutathione-requiring prostaglandin D synthase HPGDS Hematopoietic prostaglandin D synthase Hematopoietic prostaglandin D synthase (HPGDS) PTGDS2 Prostaglandin D Synthase
Type:
Enzyme
Mol. Mass.:
23341.07
Organism:
Homo sapiens (Human)
Description:
The protein was expressed in E. coli strain BL21(DE3) with an N-terminal 6-His tag.
Residue:
199
  
Inhibitor
Name:
BDBM50008781
Synonyms:
7-(3-(2-ethyl-N-phenylhydrazinecarboxamide)-7-oxa-bicyclo[2.2.1]hept-2-yl)-hept-5-enoic acid SQ 29548 | SQ-29548
Type:
Small organic molecule
Emp. Form.:
C21H29N3O4
Mol. Mass.:
387.4727
SMILES:
OC(=O)CCC\C=C/C[C@H]1[C@@H]2CCC(O2)[C@H]1CNNC(=O)Nc1ccccc1
: