Target
5-hydroxytryptamine receptor 4
Ligand
BDBM50122872
Substrate
Ki
63.09±n/a nM
Comments
PDSP_1544
Citation
 Bender, EPindon, Avan Oers, IZhang, YBGommeren, WVerhasselt, PJurzak, MLeysen, JLuyten, W Structure of the human serotonin 5-HT4 receptor gene and cloning of a novel 5-HT4 splice variant. J Neurochem 74:478-89 (2000)  
Target
Name:
5-hydroxytryptamine receptor 4
Synonyms:
5-HT-4 5-HT4S 5-HT4b 5-HT4d 5-hydroxytryptamine receptor 4 5HT4R_HUMAN Serotonin (5-HT) receptor Serotonin 4 (5-HT4) receptor | Serotonin Receptor 4
Type:
Enzyme
Mol. Mass.:
43767.54
Organism:
Homo sapiens (Human)
Description:
Q13639
Residue:
388
  
Inhibitor
Name:
BDBM50122872
Synonyms:
4-Amino-5-chloro-2,3-dihydro-benzofuran-7-carboxylic acid [1-(3-methoxy-propyl)-piperidin-4-yl]-amide PRUCALOPRIDE | US9663465, prucalopride
Type:
Small organic molecule
Emp. Form.:
C18H26ClN3O3
Mol. Mass.:
367.87
SMILES:
COCCCN1CCC(CC1)NC(=O)c1cc(Cl)c(N)c2CCOc12
: