Target
Neuronal acetylcholine receptor subunit alpha-4
Ligand
BDBM50066789
Substrate
Ki
0.01±n/a nM
Comments
PDSP_219
Citation
 Mukhin, AGGündisch, DHorti, AGKoren, AOTamagnan, GKimes, ASChambers, JVaupel, DBKing, SLPicciotto, MRInnis, RBLondon, ED 5-Iodo-A-85380, an alpha4beta2 subtype-selective ligand for nicotinic acetylcholine receptors. Mol Pharmacol 57:642-9 (2000)  
Target
Name:
Neuronal acetylcholine receptor subunit alpha-4
Synonyms:
ACHA4_RAT Cholinergic, Nicotinic Alpha4Beta2 Chrna4 Neuronal acetylcholine receptor (alpha4beta2 nAChR) Neuronal acetylcholine receptor subunit alpha 4 beta 2 | Neuronal acetylcholine receptor subunit alpha-4
Type:
Enzyme
Mol. Mass.:
70196.44
Organism:
Rattus norvegicus (Rat)
Description:
P09483
Residue:
630
  
Inhibitor
Name:
BDBM50066789
Synonyms:
3-((S)-1-Azetidin-2-ylmethoxy)-5-iodo-pyridine A-85380-I | CHEMBL123433
Type:
Small organic molecule
Emp. Form.:
C9H11IN2O
Mol. Mass.:
290.1009
SMILES:
Ic1cncc(OC[C@@H]2CCN2)c1
: